Reaction Details
TargetMelanocortin receptor 4
LigandBDBM50182074
Substrate/Competitorn/a
Meas. Tech.ChEMBL_348051 (CHEMBL868466)
Ki 110±n/a nM
Citation Vos, TJBalani, SBlackburn, CChau, RWDanca, MDDrabic, SVFarrer, CAPatane, MAStroud, SGYowe, DLClaiborne, CF Identification and structure-activity relationships of a new series of Melanocortin-4 receptor antagonists. Bioorg Med Chem Lett16:2302-5 (2006) 
 
Melanocortin receptor 4
Name:Melanocortin receptor 4
Type:Enzyme
Mol. Mass.:36949.50
Organism:Homo sapiens (Human)
Description:P32245
Residue:332
BDBM50182074
NameBDBM50182074
Synonyms:CHEMBL206367 | N-{2-[2-(5-bromo-2-chloro-phenyl)-ethyl]-3-fluoro-benzoyl}-N'-(4-diethylamino-1-methyl-butyl)-guanidine
TypeSmall organic molecule
Emp. Form.C25H33BrClFN4O
Mol. Mass.539.911
SMILESCCN(CC)CCCC(C)N=C(N)NC(=O)c1cccc(F)c1CCc1cc(Br)ccc1Cl