Reaction Details
TargetPotassium voltage-gated channel subfamily H member 2
LigandBDBM50182069
Substrate/Competitorn/a
Meas. Tech.ChEMBL_348052 (CHEMBL868467)
Ki 3150±n/a nM
Citation Vos, TJBalani, SBlackburn, CChau, RWDanca, MDDrabic, SVFarrer, CAPatane, MAStroud, SGYowe, DLClaiborne, CF Identification and structure-activity relationships of a new series of Melanocortin-4 receptor antagonists. Bioorg Med Chem Lett16:2302-5 (2006) 
 
Potassium voltage-gated channel subfamily H member 2
Name:Potassium voltage-gated channel subfamily H member 2
Type:Multi-pass membrane protein
Mol. Mass.:126672.65
Organism:Homo sapiens (Human)
Description:Q12809
Residue:1159
BDBM50182069
NameBDBM50182069
Synonyms:CHEMBL413931 | N-{2-[2-(5-bromo-2-methoxy-phenyl)-ethyl]-3-chloro-benzoyl}-guanidine
TypeSmall organic molecule
Emp. Form.C17H17BrClN3O2
Mol. Mass.410.693
SMILESCOc1ccc(Br)cc1CCc1c(Cl)cccc1C(=O)NC(N)=N