Reaction Details
TargetMelanocortin receptor 4
LigandBDBM50182076
Substrate/Competitorn/a
Meas. Tech.ChEMBL_348051 (CHEMBL868466)
Ki 21±n/a nM
Citation Vos, TJBalani, SBlackburn, CChau, RWDanca, MDDrabic, SVFarrer, CAPatane, MAStroud, SGYowe, DLClaiborne, CF Identification and structure-activity relationships of a new series of Melanocortin-4 receptor antagonists. Bioorg Med Chem Lett16:2302-5 (2006) 
 
Melanocortin receptor 4
Name:Melanocortin receptor 4
Type:Enzyme
Mol. Mass.:36949.50
Organism:Homo sapiens (Human)
Description:P32245
Residue:332
BDBM50182076
NameBDBM50182076
Synonyms:CHEMBL383120 | N-{2-[2-(5-bromo-2-methoxy-phenyl)-ethyl]-3-fluoro-benzoyl}-N'-[4-(octahydro-isoquinolin-2-yl)-butyl]-guanidine
TypeSmall organic molecule
Emp. Form.C30H40BrFN4O2
Mol. Mass.587.567
SMILESCOc1ccc(Br)cc1CCc1c(F)cccc1C(=O)NC(N)=NCCCCN1CCC2CCCCC2C1