Reaction Details
TargetHLA class II histocompatibility antigen gamma chain
LigandBDBM50182105
Substrate/Competitorn/a
Meas. Tech.ChEMBL_347360 (CHEMBL865649)
IC50 1600±n/a nM
Citation Grice, CATays, KKhatuya, HGustin, DJButler, CRWei, JSehon, CASun, SGu, YJiang, WThurmond, RLKarlsson, LEdwards, JP The SAR of 4-substituted (6,6-bicyclic) piperidine cathepsin S inhibitors. Bioorg Med Chem Lett16:2209-12 (2006) 
 
HLA class II histocompatibility antigen gamma chain
Name:HLA class II histocompatibility antigen gamma chain
Type:PROTEIN
Mol. Mass.:33525.85
Organism:Homo sapiens (Human)
Description:ChEMBL_347360
Residue:296
BDBM50182105
NameBDBM50182105
Synonyms:4-(1-(3-(3-(4-bromophenyl)-5-(methylsulfonyl)-4,5,6,7-tetrahydropyrazolo[4,3-c]pyridin-1-yl)propyl)piperidin-4-yl)-2H-benzo[b][1,4]oxazin-3(4H)-one | CHEMBL383835
TypeSmall organic molecule
Emp. Form.C29H34BrN5O4S
Mol. Mass.628.58
SMILESCS(=O)(=O)N1CCc2c(C1)c(nn2CCCN1CCC(CC1)N1C(=O)COc2ccccc12)-c1ccc(Br)cc1