Reaction Details
TargetHLA class II histocompatibility antigen gamma chain
LigandBDBM50182115
Substrate/Competitorn/a
Meas. Tech.ChEMBL_347360 (CHEMBL865649)
IC50 930±n/a nM
Citation Grice, CATays, KKhatuya, HGustin, DJButler, CRWei, JSehon, CASun, SGu, YJiang, WThurmond, RLKarlsson, LEdwards, JP The SAR of 4-substituted (6,6-bicyclic) piperidine cathepsin S inhibitors. Bioorg Med Chem Lett16:2209-12 (2006) 
 
HLA class II histocompatibility antigen gamma chain
Name:HLA class II histocompatibility antigen gamma chain
Type:PROTEIN
Mol. Mass.:33525.85
Organism:Homo sapiens (Human)
Description:ChEMBL_347360
Residue:296
BDBM50182115
NameBDBM50182115
Synonyms:1-(1-(2-hydroxy-3-(5-(methylsulfonyl)-3-(4-(trifluoromethyl)phenyl)-4,5,6,7-tetrahydropyrazolo[4,3-c]pyridin-1-yl)propyl)piperidin-4-yl)benzo[e][1,4]oxazepin-2(1H,3H,5H)-one | CHEMBL207003
TypeSmall organic molecule
Emp. Form.C31H36F3N5O5S
Mol. Mass.647.708
SMILESCS(=O)(=O)N1CCc2c(C1)c(nn2CC(O)CN1CCC(CC1)N1c2ccccc2COCC1=O)-c1ccc(cc1)C(F)(F)F