Reaction Details
TargetGamma-aminobutyric acid receptor subunit alpha-1/beta-3/gamma-2
LigandBDBM50182466
Substrate/Competitorn/a
Meas. Tech.ChEMBL_333414 (CHEMBL853068)
Ki 13±n/a nM
Citation Russell, MGCarling, RWStreet, LJHallett, DJGoodacre, SMezzogori, EReader, MCook, SMBromidge, FANewman, RSmith, AJWafford, KAMarshall, GRReynolds, DSDias, RFerris, PStanley, JLincoln, RTye, SJSheppard, WFSohal, BPike, ADominguez, MAtack, JRCastro, JL Discovery of imidazo[1,2-b][1,2,4]triazines as GABA(A) alpha2/3 subtype selective agonists for the treatment of anxiety. J Med Chem49:1235-8 (2006) 
 
Gamma-aminobutyric acid receptor subunit alpha-1/beta-3/gamma-2
Name:Gamma-aminobutyric acid receptor subunit alpha-1/beta-3/gamma-2
Type:Protein
Mol. Mass.:n/a
Description:n/a
Components:This complex has 3 components.
Component 1
Name:Gamma-aminobutyric acid receptor subunit alpha-1
Synonyms:Benzodiazepine central GABA A Benzodiazepine liver GABA(A) receptor subunit alpha-1 GABA-A receptor GBRA1_HUMAN TBPS | agonist GABA site
Type:Protein
Mol. Mass.:51817.35
Organism:Homo sapiens (Human)
Description:P14867
Residue:456
Component 2
Name:Gamma-aminobutyric acid receptor subunit beta-3
Synonyms:GABA A receptor alpha-4/beta-3/gamma-2 GABA-A receptor GBRB3_HUMAN | agonist GABA site
Type:PROTEIN
Mol. Mass.:54130.51
Organism:Homo sapiens (Human)
Description:ChEMBL_448071
Residue:473
Component 3
Name:Gamma-aminobutyric acid receptor subunit gamma-2
Synonyms:GABA(A) receptor subunit gamma-2 GBRG2_HUMAN
Type:PROTEIN
Mol. Mass.:54172.74
Organism:Homo sapiens (Human)
Description:EBI_217
Residue:467
BDBM50182466
NameBDBM50182466
Synonyms:3'-(7-methyl-imidazo[1,2-b]pyridazin-3-yl)-biphenyl-2-carbonitrile | CHEMBL202070
TypeSmall organic molecule
Emp. Form.C20H14N4
Mol. Mass.310.352
SMILESCc1cnn2c(cnc2c1)-c1cccc(c1)-c1ccccc1C#N