Reaction Details
TargetPoly [ADP-ribose] polymerase 1
LigandBDBM50602036
Substrate/Competitorn/a
Meas. Tech.ChEMBL_2238996 (CHEMBL5152892)
IC50 0.630000±n/a nM
Citation Ren, JQuan, XLiu, YLi, JZhang, XLi, ZZhang, X Synthesis and in vitro biological evaluation of 3-ethyl-1,5-naphthyridin-2(1H)-one derivatives as potent PARP-1 selective inhibitors and PARP-1 DNA trappers. Bioorg Med Chem Lett78:0 (2022) 
 
Poly [ADP-ribose] polymerase 1
Name:Poly [ADP-ribose] polymerase 1
Type:n/a
Mol. Mass.:113114.22
Organism:Homo sapiens (Human)
Description:P09874
Residue:1014
BDBM50602036
NameBDBM50602036
Synonyms:CHEMBL5179448
TypeSmall organic molecule
Emp. Form.C24H27N7O2
Mol. Mass.445.5169
SMILESCCc1cc2ncc(CN3CCN(CC3)c3ccc(C(=O)NC)c4nccn34)cc2[nH]c1=O