Reaction Details
TargetPoly [ADP-ribose] polymerase 1
LigandBDBM50602039
Substrate/Competitorn/a
Meas. Tech.ChEMBL_2238996 (CHEMBL5152892)
IC50 0.400000±n/a nM
Citation Ren, JQuan, XLiu, YLi, JZhang, XLi, ZZhang, X Synthesis and in vitro biological evaluation of 3-ethyl-1,5-naphthyridin-2(1H)-one derivatives as potent PARP-1 selective inhibitors and PARP-1 DNA trappers. Bioorg Med Chem Lett78:0 (2022) 
 
Poly [ADP-ribose] polymerase 1
Name:Poly [ADP-ribose] polymerase 1
Type:n/a
Mol. Mass.:113114.22
Organism:Homo sapiens (Human)
Description:P09874
Residue:1014
BDBM50602039
NameBDBM50602039
Synonyms:CHEMBL5206717
TypeSmall organic molecule
Emp. Form.C24H26N4O2
Mol. Mass.402.4888
SMILESCCc1cc2ncc(CN3CCc4cc(\C=C\C(=O)NC)ccc4C3)cc2[nH]c1=O