Reaction Details
TargetPoly [ADP-ribose] polymerase 1
LigandBDBM50602049
Substrate/Competitorn/a
Meas. Tech.ChEMBL_2238996 (CHEMBL5152892)
IC50 0.490000±n/a nM
Citation Ren, JQuan, XLiu, YLi, JZhang, XLi, ZZhang, X Synthesis and in vitro biological evaluation of 3-ethyl-1,5-naphthyridin-2(1H)-one derivatives as potent PARP-1 selective inhibitors and PARP-1 DNA trappers. Bioorg Med Chem Lett78:0 (2022) 
 
Poly [ADP-ribose] polymerase 1
Name:Poly [ADP-ribose] polymerase 1
Type:n/a
Mol. Mass.:113114.22
Organism:Homo sapiens (Human)
Description:P09874
Residue:1014
BDBM50602049
NameBDBM50602049
Synonyms:CHEMBL5179882
TypeSmall organic molecule
Emp. Form.C22H26N6O2
Mol. Mass.406.4808
SMILESCCc1cc2ncc(CN3CC[C@H](C3)Nc3ccc(nc3)C(=O)NC)cc2[nH]c1=O