Reaction Details
TargetAryl hydrocarbon receptor
LigandBDBM50602335
Substrate/Competitorn/a
Meas. Tech.ChEMBL_2240103 (CHEMBL5153999)
EC50 0.700000±n/a nM
Citation Flegel, JShaaban, SJia, ZJSchulte, BLian, YKrzyzanowski, AMetz, MSchneidewind, TWesseler, FFlegel, AReich, ABrause, AXue, GZhang, MDötsch, LStender, IDHoffmann, JEScheel, RJanning, PRastinejad, FSchade, DStrohmann, CAntonchick, APSievers, SMoura-Alves, PZiegler, SWaldmann, H The Highly Potent AhR Agonist Picoberin Modulates Hh-Dependent Osteoblast Differentiation. J Med Chem65:16268-16289 (2022) 
 
Aryl hydrocarbon receptor
Name:Aryl hydrocarbon receptor
Type:PROTEIN
Mol. Mass.:96143.77
Organism:Homo sapiens (Human)
Description:ChEMBL_1503828
Residue:848
BDBM50602335
NameBDBM50602335
Synonyms:CHEMBL5186309
TypeSmall organic molecule
Emp. Form.C17H13BrClNO
Mol. Mass.362.648
SMILES[H][C@@]12Cc3cc(Cl)c(Br)cc3C(=O)N1CCc1ccccc21