Reaction Details
TargetMu-type opioid receptor
LigandBDBM50182944
Substrate/Competitorn/a
Meas. Tech.ChEMBL_349386 (CHEMBL863863)
Ki 1.2±n/a nM
Citation Breslin, HJCai, CMiskowski, TACoutinho, SVZhang, SPHornby, PHe, W Identification of potent phenyl imidazoles as opioid receptor agonists. Bioorg Med Chem Lett16:2505-8 (2006) 
 
Mu-type opioid receptor
Name:Mu-type opioid receptor
Type:G Protein-Coupled Receptor (GPCR)
Mol. Mass.:44503.11
Organism:Rattus norvegicus (rat)
Description:Competition binding assays were carried out using membrane preparations from transfected HN9.10 cells that constitutively expressed the mu opioid receptor.
Residue:398
BDBM50182944
NameBDBM50182944
Synonyms:4-((S)-2-amino-3-oxo-3-((S)-2-(4-phenyl-1H-imidazol-2-yl)piperidin-1-yl)propyl)benzamide | CHEMBL204996
TypeSmall organic molecule
Emp. Form.C24H27N5O2
Mol. Mass.417.5035
SMILESN[C@@H](Cc1ccc(cc1)C(N)=O)C(=O)N1CCCC[C@H]1c1nc(c[nH]1)-c1ccccc1