Reaction Details
TargetHistone deacetylase 6
LigandBDBM50602361
Substrate/Competitorn/a
Meas. Tech.ChEMBL_2240184 (CHEMBL5154080)
EC50 460±n/a nM
Citation Sinatra, LYang, JSchliehe-Diecks, JDienstbier, NVogt, MGebing, PBachmann, LMSönnichsen, MLenz, TStühler, KSchöler, ABorkhardt, ABhatia, SHansen, FK Solid-Phase Synthesis of Cereblon-Recruiting Selective Histone Deacetylase 6 Degraders (HDAC6 PROTACs) with Antileukemic Activity. J Med Chem65:16860-16878 (2022) 
 
Histone deacetylase 6
Name:Histone deacetylase 6
Type:Chromatin regulator; hydrolase; repressor
Mol. Mass.:131381.51
Organism:Homo sapiens (Human)
Description:Q9UBN7
Residue:1215
BDBM50602361
NameBDBM50602361
Synonyms:CHEMBL5206304
TypeSmall organic molecule
Emp. Form.C37H46N6O10
Mol. Mass.734.7953
SMILESONC(=O)CCCCCCNC(=O)c1ccc(NC(=O)CCCCCCCNC(=O)COc2cccc3C(=O)N(C4CCC(=O)NC4=O)C(=O)c23)cc1