Reaction Details
TargetCytochrome P450 3A4
LigandBDBM50183079
Substrate/Competitorn/a
Meas. Tech.ChEMBL_350785 (CHEMBL869683)
IC50 7900±n/a nM
Citation Lafite, PDijols, SBuisson, DMacherey, ACZeldin, DCDansette, PMMansuy, D Design and synthesis of selective, high-affinity inhibitors of human cytochrome P450 2J2. Bioorg Med Chem Lett16:2777-80 (2006) 
 
Cytochrome P450 3A4
Name:Cytochrome P450 3A4
Type:Enzyme
Mol. Mass.:57349.57
Organism:Homo sapiens (Human)
Description:n/a
Residue:503
BDBM50183079
NameBDBM50183079
Synonyms:4-(4-(hydroxydiphenylmethyl)piperidin-1-yl)-1-(4-propylphenyl)butan-1-one | CHEMBL208528
TypeSmall organic molecule
Emp. Form.C31H37NO2
Mol. Mass.455.631
SMILESCCCc1ccc(cc1)C(=O)CCCN1CCC(CC1)C(O)(c1ccccc1)c1ccccc1