Reaction Details
TargetSodium-dependent noradrenaline transporter
LigandBDBM50183127
Substrate/Competitorn/a
Meas. Tech.ChEMBL_355136 (CHEMBL853189)
Ki 3.3±n/a nM
Citation Boot, JRBoulet, SLClark, BPCases-Thomas, MJDelhaye, LDiker, KFairhurst, JFindlay, JGallagher, PTGilmore, JHarris, JRMasters, JJMitchell, SNNaik, MSimmonds, RGSmith, SMRichards, SJTimms, GHWhatton, MAWolfe, CNWood, VA N-Alkyl-N-arylmethylpiperidin-4-amines: novel dual inhibitors of serotonin and norepinephrine reuptake. Bioorg Med Chem Lett16:2714-8 (2006) 
 
Sodium-dependent noradrenaline transporter
Name:Sodium-dependent noradrenaline transporter
Type:Multi-pass membrane protein
Mol. Mass.:69337.72
Organism:Homo sapiens (Human)
Description:P23975
Residue:617
BDBM50183127
NameBDBM50183127
Synonyms:CHEMBL208067 | isobutyl-(2-methyl-benzyl)-piperidin-4-yl-amine fumaric acid salt
TypeSmall organic molecule
Emp. Form.C17H28N2
Mol. Mass.260.4176
SMILESCC(C)CN(Cc1ccccc1C)C1CCNCC1