Reaction Details
TargetSodium-dependent serotonin transporter
LigandBDBM50183142
Substrate/Competitorn/a
Meas. Tech.ChEMBL_355134 (CHEMBL853187)
Ki 3.1±n/a nM
Citation Boot, JRBoulet, SLClark, BPCases-Thomas, MJDelhaye, LDiker, KFairhurst, JFindlay, JGallagher, PTGilmore, JHarris, JRMasters, JJMitchell, SNNaik, MSimmonds, RGSmith, SMRichards, SJTimms, GHWhatton, MAWolfe, CNWood, VA N-Alkyl-N-arylmethylpiperidin-4-amines: novel dual inhibitors of serotonin and norepinephrine reuptake. Bioorg Med Chem Lett16:2714-8 (2006) 
 
Sodium-dependent serotonin transporter
Name:Sodium-dependent serotonin transporter
Type:Multi-pass membrane protein
Mol. Mass.:70322.51
Organism:Homo sapiens (Human)
Description:P31645
Residue:630
BDBM50183142
NameBDBM50183142
Synonyms:2-((4-fluoro-2-(trifluoromethyl)benzyl)(piperidin-4-yl)amino)ethanol fumaric acid salt | CHEMBL207635
TypeSmall organic molecule
Emp. Form.C15H20F4N2O
Mol. Mass.320.3257
SMILESOCCN(Cc1ccc(F)cc1C(F)(F)F)C1CCNCC1