Reaction Details
TargetSodium-dependent serotonin transporter
LigandBDBM50183144
Substrate/Competitorn/a
Meas. Tech.ChEMBL_355134 (CHEMBL853187)
Ki 1.4±n/a nM
Citation Boot, JRBoulet, SLClark, BPCases-Thomas, MJDelhaye, LDiker, KFairhurst, JFindlay, JGallagher, PTGilmore, JHarris, JRMasters, JJMitchell, SNNaik, MSimmonds, RGSmith, SMRichards, SJTimms, GHWhatton, MAWolfe, CNWood, VA N-Alkyl-N-arylmethylpiperidin-4-amines: novel dual inhibitors of serotonin and norepinephrine reuptake. Bioorg Med Chem Lett16:2714-8 (2006) 
 
Sodium-dependent serotonin transporter
Name:Sodium-dependent serotonin transporter
Type:Multi-pass membrane protein
Mol. Mass.:70322.51
Organism:Homo sapiens (Human)
Description:P31645
Residue:630
BDBM50183144
NameBDBM50183144
Synonyms:CHEMBL207810 | N-(5-fluoro-2-methoxybenzyl)-N-isobutylpiperidin-4-amine fumaric acid salt
TypeSmall organic molecule
Emp. Form.C17H27FN2O
Mol. Mass.294.4075
SMILESCOc1ccc(F)cc1CN(CC(C)C)C1CCNCC1