Reaction Details
TargetSodium-dependent serotonin transporter
LigandBDBM50183136
Substrate/Competitorn/a
Meas. Tech.ChEMBL_355134 (CHEMBL853187)
Ki 0.48±n/a nM
Citation Boot, JRBoulet, SLClark, BPCases-Thomas, MJDelhaye, LDiker, KFairhurst, JFindlay, JGallagher, PTGilmore, JHarris, JRMasters, JJMitchell, SNNaik, MSimmonds, RGSmith, SMRichards, SJTimms, GHWhatton, MAWolfe, CNWood, VA N-Alkyl-N-arylmethylpiperidin-4-amines: novel dual inhibitors of serotonin and norepinephrine reuptake. Bioorg Med Chem Lett16:2714-8 (2006) 
 
Sodium-dependent serotonin transporter
Name:Sodium-dependent serotonin transporter
Type:Multi-pass membrane protein
Mol. Mass.:70322.51
Organism:Homo sapiens (Human)
Description:P31645
Residue:630
BDBM50183136
NameBDBM50183136
Synonyms:CHEMBL208533 | N-(2-chloro-3-(trifluoromethyl)benzyl)-N-isobutylpiperidin-4-amine fumaric acid salt
TypeSmall organic molecule
Emp. Form.C17H24ClF3N2
Mol. Mass.348.834
SMILESCC(C)CN(Cc1cccc(c1Cl)C(F)(F)F)C1CCNCC1