Reaction Details
TargetReverse transcriptase/RNaseH
LigandBDBM50183213
Substrate/Competitorn/a
Meas. Tech.ChEMBL_355438 (CHEMBL868998)
IC50 10±n/a nM
Citation Muraglia, EKinzel, ODLaufer, RMiller, MDMoyer, GMunshi, VOrvieto, FPalumbi, MCPescatore, GRowley, MWilliams, PDSumma, V Tetrazole thioacetanilides: potent non-nucleoside inhibitors of WT HIV reverse transcriptase and its K103N mutant. Bioorg Med Chem Lett16:2748-52 (2006) 
 
Reverse transcriptase/RNaseH
Name:Reverse transcriptase/RNaseH
Type:PROTEIN
Mol. Mass.:65229.15
Organism:Human immunodeficiency virus 1
Description:ChEMBL_1473730
Residue:566
BDBM50183213
NameBDBM50183213
Synonyms:2-(1-(2-chloro-5-fluorophenyl)-1H-tetrazol-5-ylthio)-N-(2-nitrophenyl)acetamide | CHEMBL205764
TypeSmall organic molecule
Emp. Form.C15H10ClFN6O3S
Mol. Mass.408.795
SMILES[O-][N+](=O)c1ccccc1NC(=O)CSc1nnnn1-c1cc(F)ccc1Cl