Reaction Details
TargetReverse transcriptase/RNaseH
LigandBDBM50183216
Substrate/Competitorn/a
Meas. Tech.ChEMBL_355438 (CHEMBL868998)
IC50 200±n/a nM
Citation Muraglia, EKinzel, ODLaufer, RMiller, MDMoyer, GMunshi, VOrvieto, FPalumbi, MCPescatore, GRowley, MWilliams, PDSumma, V Tetrazole thioacetanilides: potent non-nucleoside inhibitors of WT HIV reverse transcriptase and its K103N mutant. Bioorg Med Chem Lett16:2748-52 (2006) 
 
Reverse transcriptase/RNaseH
Name:Reverse transcriptase/RNaseH
Type:PROTEIN
Mol. Mass.:65229.15
Organism:Human immunodeficiency virus 1
Description:ChEMBL_1473730
Residue:566
BDBM50183216
NameBDBM50183216
Synonyms:2-(1-mesityl-1H-tetrazol-5-ylthio)-N-(3-nitrophenyl)acetamide | CHEMBL381286
TypeSmall organic molecule
Emp. Form.C18H18N6O3S
Mol. Mass.398.439
SMILESCc1cc(C)c(c(C)c1)-n1nnnc1SCC(=O)Nc1cccc(c1)[N+]([O-])=O