Reaction Details
TargetIntegrin alpha-V/beta-5
LigandBDBM50183594
Substrate/Competitorn/a
Meas. Tech.ChEMBL_335364 (CHEMBL867621)
IC50 3.4±n/a nM
Citation Dal Pozzo, ANi, MMuzi, Lde Castiglione, RMondelli, RMazzini, SPenco, SPisano, CCastorina, MGiannini, G Incorporation of the unusual C(alpha)-fluoroalkylamino acids into cyclopeptides: synthesis of arginine-glycine-aspartate (RGD) analogues and study of their conformational and biological behavior. J Med Chem49:1808-17 (2006) 
 
Integrin alpha-V/beta-5
Name:Integrin alpha-V/beta-5
Type:Enzyme
Mol. Mass.:n/a
Description:n/a
Components:This complex has 2 components.
Component 1
Name:Integrin alpha-V
Synonyms:ITAV_HUMAN Integrin alpha-V/alpha-5 VNRA Vitronectin receptor | Vitronectin receptor subunit alpha
Type:PROTEIN
Mol. Mass.:116024.92
Organism:Homo sapiens (Human)
Description:ChEMBL_582336
Residue:1048
Component 2
Name:Integrin beta-5
Synonyms:ITB5_HUMAN | ITGB5
Type:PROTEIN
Mol. Mass.:88047.37
Organism:Homo sapiens (Human)
Description:EBI_10915
Residue:799
BDBM50183594
NameBDBM50183594
Synonyms:CHEMBL203693 | c[RGDf-(S)-alpha-TfmV]
TypeSmall organic molecule
Emp. Form.C27H37F3N8O7
Mol. Mass.642.6273
SMILES[#6]-[#6](-[#6])[C@@]1([#7]-[#6](=O)-[#6@@H](-[#6]-c2ccccc2)-[#7]-[#6](=O)-[#6@H](-[#6]-[#6](-[#8])=O)-[#7]-[#6](=O)-[#6]-[#7]-[#6](=O)-[#6@H](-[#6]-[#6]-[#6]\[#7]=[#6](\[#7])-[#7])-[#7]-[#6]1=O)C(F)(F)F