Reaction Details
TargetPolyphenol oxidase 2
LigandBDBM50183699
Substrate/Competitorn/a
Meas. Tech.ChEMBL_354949 (CHEMBL870122)
Ki 1300±n/a nM
Citation Cho, SJRoh, JSSun, WSKim, SHPark, KD N-Benzylbenzamides: a new class of potent tyrosinase inhibitors. Bioorg Med Chem Lett16:2682-4 (2006) 
 
Polyphenol oxidase 2
Name:Polyphenol oxidase 2
Type:Protein
Mol. Mass.:63923.66
Organism:Agaricus bisporus (Common mushroom)
Description:O42713
Residue:556
BDBM50183699
NameBDBM50183699
Synonyms:CHEMBL437510 | N-(2,4-dihydroxybenzyl)-3,5-dihydroxybenzamide
TypeSmall organic molecule
Emp. Form.C14H13NO5
Mol. Mass.275.2567
SMILESOc1ccc(CNC(=O)c2cc(O)cc(O)c2)c(O)c1