Reaction Details
TargetCollagenase 3
LigandBDBM50183786
Substrate/Competitorn/a
Meas. Tech.ChEMBL_354053 (CHEMBL870007)
Ki 55±n/a nM
Citation Janser, PNeumann, UMiltz, WFeifel, RBuhl, T A cassette-dosing approach for improvement of oral bioavailability of dual TACE/MMP inhibitors. Bioorg Med Chem Lett16:2632-6 (2006) 
 
Collagenase 3
Name:Collagenase 3
Type:Enzyme
Mol. Mass.:53808.06
Organism:Homo sapiens (Human)
Description:P45452
Residue:471
BDBM50183786
NameBDBM50183786
Synonyms:(2R,3S)-N-hydroxy-2-(hydroxymethyl)-3-(4-methoxyphenyl)-4-oxo-4-(piperidin-1-yl)butanamide | CHEMBL206875
TypeSmall organic molecule
Emp. Form.C17H24N2O5
Mol. Mass.336.3829
SMILESCOc1ccc(cc1)[C@H]([C@H](CO)C(=O)NO)C(=O)N1CCCCC1