Reaction Details
TargetCollagenase 3
LigandBDBM50183781
Substrate/Competitorn/a
Meas. Tech.ChEMBL_354053 (CHEMBL870007)
Ki 2±n/a nM
Citation Janser, PNeumann, UMiltz, WFeifel, RBuhl, T A cassette-dosing approach for improvement of oral bioavailability of dual TACE/MMP inhibitors. Bioorg Med Chem Lett16:2632-6 (2006) 
 
Collagenase 3
Name:Collagenase 3
Type:Enzyme
Mol. Mass.:53808.06
Organism:Homo sapiens (Human)
Description:P45452
Residue:471
BDBM50183781
NameBDBM50183781
Synonyms:(S)-1-((2S,3S)-2-(4-chlorophenyl)-3-(hydroxycarbamoyl)pentanoyl)-N-methylpiperidine-2-carboxamide | CHEMBL382705
TypeSmall organic molecule
Emp. Form.C19H26ClN3O4
Mol. Mass.395.88
SMILESCC[C@@H]([C@H](C(=O)N1CCCC[C@H]1C(=O)NC)c1ccc(Cl)cc1)C(=O)NO