Reaction Details
TargetDisintegrin and metalloproteinase domain-containing protein 17
LigandBDBM50183786
Substrate/Competitorn/a
Meas. Tech.ChEMBL_354054 (CHEMBL870008)
Ki 66±n/a nM
Citation Janser, PNeumann, UMiltz, WFeifel, RBuhl, T A cassette-dosing approach for improvement of oral bioavailability of dual TACE/MMP inhibitors. Bioorg Med Chem Lett16:2632-6 (2006) 
 
Disintegrin and metalloproteinase domain-containing protein 17
Name:Disintegrin and metalloproteinase domain-containing protein 17
Type:Enzyme
Mol. Mass.:93007.89
Organism:Homo sapiens (Human)
Description:
Residue:824
BDBM50183786
NameBDBM50183786
Synonyms:(2R,3S)-N-hydroxy-2-(hydroxymethyl)-3-(4-methoxyphenyl)-4-oxo-4-(piperidin-1-yl)butanamide | CHEMBL206875
TypeSmall organic molecule
Emp. Form.C17H24N2O5
Mol. Mass.336.3829
SMILESCOc1ccc(cc1)[C@H]([C@H](CO)C(=O)NO)C(=O)N1CCCCC1