Reaction Details
TargetDisintegrin and metalloproteinase domain-containing protein 17
LigandBDBM50183784
Substrate/Competitorn/a
Meas. Tech.ChEMBL_354055 (CHEMBL870009)
IC50 48±n/a nM
Citation Janser, PNeumann, UMiltz, WFeifel, RBuhl, T A cassette-dosing approach for improvement of oral bioavailability of dual TACE/MMP inhibitors. Bioorg Med Chem Lett16:2632-6 (2006) 
 
Disintegrin and metalloproteinase domain-containing protein 17
Name:Disintegrin and metalloproteinase domain-containing protein 17
Type:Enzyme
Mol. Mass.:93007.89
Organism:Homo sapiens (Human)
Description:
Residue:824
BDBM50183784
NameBDBM50183784
Synonyms:(2S,3R)-N1-((S)-3,3-dimethyl-1-(methylamino)-1-oxobutan-2-yl)-N4-hydroxy-3-(hydroxymethyl)-2-(4-methoxyphenyl)succinamide CHEMBL72511 PKF-242-484 | TNF-484
TypeSmall organic molecule
Emp. Form.C19H29N3O6
Mol. Mass.395.4501
SMILESCNC(=O)[C@@H](NC(=O)[C@@H]([C@H](CO)C(=O)NO)c1ccc(OC)cc1)C(C)(C)C