Reaction Details
TargetTau-tubulin kinase 2
LigandBDBM50602885
Substrate/Competitorn/a
Meas. Tech.ChEMBL_2242605 (CHEMBL5156815)
IC50 170±n/a nM
Citation Nozal, VMartínez-González, LGomez-Almeria, MGonzalo-Consuegra, CSantana, PChaikuad, APérez-Cuevas, EKnapp, SLietha, DRamírez, DPetralla, SMonti, BGil, CMartín-Requero, APalomo, Vde Lago, EMartinez, A TDP-43 Modulation by Tau-Tubulin Kinase 1 Inhibitors: A New Avenue for Future Amyotrophic Lateral Sclerosis Therapy. J Med Chem65:1585-1607 (2022) 
 
Tau-tubulin kinase 2
Name:Tau-tubulin kinase 2
Type:PROTEIN
Mol. Mass.:137421.41
Organism:Homo sapiens (Human)
Description:ChEMBL_109480
Residue:1244
BDBM50602885
NameBDBM50602885
Synonyms:CHEMBL5193906
TypeSmall organic molecule
Emp. Form.C19H23BrN6O
Mol. Mass.431.33
SMILESCC1(N)CCN(Cc2ccn3ncnc(Nc4cc(O)cc(Br)c4)c23)CC1