Reaction Details
TargetTau-tubulin kinase 2
LigandBDBM50602886
Substrate/Competitorn/a
Meas. Tech.ChEMBL_2242605 (CHEMBL5156815)
IC50 2.7±n/a nM
Citation Nozal, VMartínez-González, LGomez-Almeria, MGonzalo-Consuegra, CSantana, PChaikuad, APérez-Cuevas, EKnapp, SLietha, DRamírez, DPetralla, SMonti, BGil, CMartín-Requero, APalomo, Vde Lago, EMartinez, A TDP-43 Modulation by Tau-Tubulin Kinase 1 Inhibitors: A New Avenue for Future Amyotrophic Lateral Sclerosis Therapy. J Med Chem65:1585-1607 (2022) 
 
Tau-tubulin kinase 2
Name:Tau-tubulin kinase 2
Type:PROTEIN
Mol. Mass.:137421.41
Organism:Homo sapiens (Human)
Description:ChEMBL_109480
Residue:1244
BDBM50602886
NameBDBM50602886
Synonyms:CHEMBL5182036
TypeSmall organic molecule
Emp. Form.C18H19N5O2
Mol. Mass.337.3758
SMILESCC[C@@](C)(O)C#Cc1cc2n(ccc2cn1)-c1cc(OC)nc(N)n1