Reaction Details
TargetTau-tubulin kinase 2
LigandBDBM50328192
Substrate/Competitorn/a
Meas. Tech.ChEMBL_2242610 (CHEMBL5156820)
IC50 8800±n/a nM
Citation Nozal, VMartínez-González, LGomez-Almeria, MGonzalo-Consuegra, CSantana, PChaikuad, APérez-Cuevas, EKnapp, SLietha, DRamírez, DPetralla, SMonti, BGil, CMartín-Requero, APalomo, Vde Lago, EMartinez, A TDP-43 Modulation by Tau-Tubulin Kinase 1 Inhibitors: A New Avenue for Future Amyotrophic Lateral Sclerosis Therapy. J Med Chem65:1585-1607 (2022) 
 
Tau-tubulin kinase 2
Name:Tau-tubulin kinase 2
Type:PROTEIN
Mol. Mass.:137421.41
Organism:Homo sapiens (Human)
Description:ChEMBL_109480
Residue:1244
BDBM50328192
NameBDBM50328192
Synonyms:CHEMBL1257781 US9670214, TABLE 12.2
TypeSmall organic molecule
Emp. Form.C13H9F3N4O
Mol. Mass.294.232
SMILESFC(F)(F)Oc1ccc(Nc2ncnc3[nH]ccc23)cc1