Reaction Details
TargetTau-tubulin kinase 2
LigandBDBM50602923
Substrate/Competitorn/a
Meas. Tech.ChEMBL_2242610 (CHEMBL5156820)
IC50 3900±n/a nM
Citation Nozal, VMartínez-González, LGomez-Almeria, MGonzalo-Consuegra, CSantana, PChaikuad, APérez-Cuevas, EKnapp, SLietha, DRamírez, DPetralla, SMonti, BGil, CMartín-Requero, APalomo, Vde Lago, EMartinez, A TDP-43 Modulation by Tau-Tubulin Kinase 1 Inhibitors: A New Avenue for Future Amyotrophic Lateral Sclerosis Therapy. J Med Chem65:1585-1607 (2022) 
 
Tau-tubulin kinase 2
Name:Tau-tubulin kinase 2
Type:PROTEIN
Mol. Mass.:137421.41
Organism:Homo sapiens (Human)
Description:ChEMBL_109480
Residue:1244
BDBM50602923
NameBDBM50602923
Synonyms:CHEMBL5178871
TypeSmall organic molecule
Emp. Form.C19H14F3N5O
Mol. Mass.385.3426
SMILESNc1nc(Nc2ccc(Oc3cccc(c3)C(F)(F)F)cc2)c2cc[nH]c2n1