Reaction Details
TargetTau-tubulin kinase 2
LigandBDBM50602924
Substrate/Competitorn/a
Meas. Tech.ChEMBL_2242610 (CHEMBL5156820)
IC50 22720±n/a nM
Citation Nozal, VMartínez-González, LGomez-Almeria, MGonzalo-Consuegra, CSantana, PChaikuad, APérez-Cuevas, EKnapp, SLietha, DRamírez, DPetralla, SMonti, BGil, CMartín-Requero, APalomo, Vde Lago, EMartinez, A TDP-43 Modulation by Tau-Tubulin Kinase 1 Inhibitors: A New Avenue for Future Amyotrophic Lateral Sclerosis Therapy. J Med Chem65:1585-1607 (2022) 
 
Tau-tubulin kinase 2
Name:Tau-tubulin kinase 2
Type:PROTEIN
Mol. Mass.:137421.41
Organism:Homo sapiens (Human)
Description:ChEMBL_109480
Residue:1244
BDBM50602924
NameBDBM50602924
Synonyms:CHEMBL5203204
TypeSmall organic molecule
Emp. Form.C18H13N5O2S
Mol. Mass.363.393
SMILES[O-][N+](=O)c1ccc(Sc2ccc(Nc3ncnc4[nH]ccc34)cc2)cc1