Reaction Details
TargetTau-tubulin kinase 2
LigandBDBM50602926
Substrate/Competitorn/a
Meas. Tech.ChEMBL_2242610 (CHEMBL5156820)
IC50 1210±n/a nM
Citation Nozal, VMartínez-González, LGomez-Almeria, MGonzalo-Consuegra, CSantana, PChaikuad, APérez-Cuevas, EKnapp, SLietha, DRamírez, DPetralla, SMonti, BGil, CMartín-Requero, APalomo, Vde Lago, EMartinez, A TDP-43 Modulation by Tau-Tubulin Kinase 1 Inhibitors: A New Avenue for Future Amyotrophic Lateral Sclerosis Therapy. J Med Chem65:1585-1607 (2022) 
 
Tau-tubulin kinase 2
Name:Tau-tubulin kinase 2
Type:PROTEIN
Mol. Mass.:137421.41
Organism:Homo sapiens (Human)
Description:ChEMBL_109480
Residue:1244
BDBM50602926
NameBDBM50602926
Synonyms:CHEMBL5200160 | US11814388, Compound 9
TypeSmall organic molecule
Emp. Form.C19H16N4O
Mol. Mass.316.3565
SMILESC(Oc1ccc(Nc2ncnc3[nH]ccc23)cc1)c1ccccc1