Reaction Details
TargetTau-tubulin kinase 2
LigandBDBM50602929
Substrate/Competitorn/a
Meas. Tech.ChEMBL_2242610 (CHEMBL5156820)
IC50 2870±n/a nM
Citation Nozal, VMartínez-González, LGomez-Almeria, MGonzalo-Consuegra, CSantana, PChaikuad, APérez-Cuevas, EKnapp, SLietha, DRamírez, DPetralla, SMonti, BGil, CMartín-Requero, APalomo, Vde Lago, EMartinez, A TDP-43 Modulation by Tau-Tubulin Kinase 1 Inhibitors: A New Avenue for Future Amyotrophic Lateral Sclerosis Therapy. J Med Chem65:1585-1607 (2022) 
 
Tau-tubulin kinase 2
Name:Tau-tubulin kinase 2
Type:PROTEIN
Mol. Mass.:137421.41
Organism:Homo sapiens (Human)
Description:ChEMBL_109480
Residue:1244
BDBM50602929
NameBDBM50602929
Synonyms:CHEMBL5193034
TypeSmall organic molecule
Emp. Form.C22H18ClN7O
Mol. Mass.431.878
SMILESClc1ccc(Cn2cc(COc3ccc(Nc4ncnc5[nH]ccc45)cc3)nn2)cc1