Reaction Details
TargetTau-tubulin kinase 2
LigandBDBM50602934
Substrate/Competitorn/a
Meas. Tech.ChEMBL_2242610 (CHEMBL5156820)
IC50 6050±n/a nM
Citation Nozal, VMartínez-González, LGomez-Almeria, MGonzalo-Consuegra, CSantana, PChaikuad, APérez-Cuevas, EKnapp, SLietha, DRamírez, DPetralla, SMonti, BGil, CMartín-Requero, APalomo, Vde Lago, EMartinez, A TDP-43 Modulation by Tau-Tubulin Kinase 1 Inhibitors: A New Avenue for Future Amyotrophic Lateral Sclerosis Therapy. J Med Chem65:1585-1607 (2022) 
 
Tau-tubulin kinase 2
Name:Tau-tubulin kinase 2
Type:PROTEIN
Mol. Mass.:137421.41
Organism:Homo sapiens (Human)
Description:ChEMBL_109480
Residue:1244
BDBM50602934
NameBDBM50602934
Synonyms:CHEMBL5206548
TypeSmall organic molecule
Emp. Form.C17H13N5O
Mol. Mass.303.318
SMILESN(c1ccc(Oc2cccnc2)cc1)c1ncnc2[nH]ccc12