Reaction Details
TargetSerine/threonine-protein kinase Nek1
LigandBDBM50603401
Substrate/Competitorn/a
Meas. Tech.ChEMBL_2243864 (CHEMBL5158074)
IC50 8800±n/a nM
Citation Baumann, GMeckel, TBöhm, KShih, YHDickhaut, MReichardt, TPilakowski, JPehl, USchmidt, B Illuminating a Dark Kinase: Structure-Guided Design, Synthesis, and Evaluation of a Potent Nek1 Inhibitor and Its Effects on the Embryonic Zebrafish Pronephros. J Med Chem65:1265-1282 (2022) 
 
Serine/threonine-protein kinase Nek1
Name:Serine/threonine-protein kinase Nek1
Type:Protein
Mol. Mass.:142810.07
Organism:Homo sapiens (Human)
Description:n/a
Residue:1258
BDBM50603401
NameBDBM50603401
Synonyms:CHEMBL5197360
TypeSmall organic molecule
Emp. Form.C17H17N3O4S
Mol. Mass.359.4
SMILESCC(=O)OCCNS(=O)(=O)c1ccc(cc1)-c1ccnc2[nH]ccc12