Reaction Details
TargetPeroxisome proliferator-activated receptor gamma
LigandBDBM50184652
Substrate/Competitorn/a
Meas. Tech.ChEMBL_355605 (CHEMBL853176)
EC50>10000±n/a nM
Citation Epple, RAzimioara, MRusso, RBursulaya, BTian, SSGerken, AIskandar, M 1,3,5-Trisubstituted aryls as highly selective PPARdelta agonists. Bioorg Med Chem Lett16:2969-73 (2006) 
 
Peroxisome proliferator-activated receptor gamma
Name:Peroxisome proliferator-activated receptor gamma
Type:Nuclear Receptor
Mol. Mass.:57613.46
Organism:Homo sapiens (Human)
Description:P37231
Residue:505
BDBM50184652
NameBDBM50184652
Synonyms:CHEMBL210469 | [4-(4,4''-Bis-trifluoromethyl-[1,1';3',1'']terphenyl-5'-ylmethoxy)-2-methyl-phenoxy]-acetic acid
TypeSmall organic molecule
Emp. Form.C30H22F6O4
Mol. Mass.560.4837
SMILESCc1cc(OCc2cc(cc(c2)-c2ccc(cc2)C(F)(F)F)-c2ccc(cc2)C(F)(F)F)ccc1OCC(O)=O