Reaction Details
TargetCannabinoid receptor 1
LigandBDBM50185037
Substrate/Competitorn/a
Meas. Tech.ChEMBL_342812 (CHEMBL868883)
Ki 3500±n/a nM
Citation Appendino, GMinassi, ABerton, LMoriello, ASCascio, MGDe Petrocellis, LDi Marzo, V Oxyhomologues of anandamide and related endolipids: chemoselective synthesis and biological activity. J Med Chem49:2333-8 (2006) 
 
Cannabinoid receptor 1
Name:Cannabinoid receptor 1
Type:G Protein-Coupled Receptor (GPCR)
Mol. Mass.:52868.96
Organism:Homo sapiens (Human)
Description:P21554
Residue:472
BDBM50185037
NameBDBM50185037
Synonyms:CHEMBL203380 | O-arachidonoyl-N-(2-hydroxyethyl)hydroxylamine
TypeSmall organic molecule
Emp. Form.C22H37NO3
Mol. Mass.363.5341
SMILESCCCCC\C=C/C\C=C/C\C=C/C\C=C/CCCC(=O)ONCCO