Reaction Details
TargetCannabinoid receptor 2
LigandBDBM50185032
Substrate/Competitorn/a
Meas. Tech.ChEMBL_342813 (CHEMBL868884)
Ki>10000±n/a nM
Citation Appendino, GMinassi, ABerton, LMoriello, ASCascio, MGDe Petrocellis, LDi Marzo, V Oxyhomologues of anandamide and related endolipids: chemoselective synthesis and biological activity. J Med Chem49:2333-8 (2006) 
 
Cannabinoid receptor 2
Name:Cannabinoid receptor 2
Type:G Protein-Coupled Receptor (GPCR)
Mol. Mass.:39690.94
Organism:Homo sapiens (Human)
Description:P34972
Residue:360
BDBM50185032
NameBDBM50185032
Synonyms:CHEMBL206425 | N-palmitoyl-N-(2-hydroxyethyl)hydroxylamine
TypeSmall organic molecule
Emp. Form.C18H37NO3
Mol. Mass.315.4913
(=O)N(O)CCO