Reaction Details
TargetLysine-specific histone demethylase 2
LigandBDBM50603908
Substrate/Competitorn/a
Meas. Tech.ChEMBL_2245503 (CHEMBL5159713)
IC50 1480±n/a nM
Citation Li, CSu, MZhu, WKan, WGe, TXu, GWang, SSheng, LGao, FYe, YWang, JZhou, YLi, JLiu, H Structure-Activity Relationship Study of Indolin-5-yl-cyclopropanamine Derivatives as Selective Lysine Specific Demethylase 1 (LSD1) Inhibitors. J Med Chem65:4335-4349 (2022) 
 
Lysine-specific histone demethylase 2
Name:Lysine-specific histone demethylase 2
Type:PROTEIN
Mol. Mass.:92112.91
Organism:Homo sapiens (Human)
Description:ChEMBL_992590
Residue:822
BDBM50603908
NameBDBM50603908
Synonyms:CHEMBL5177857
TypeSmall organic molecule
Emp. Form.C24H31N3O2S
Mol. Mass.425.587
SMILESN[C@H]1CC[C@H](CNC2CC2c2ccc3N(CCc3c2)S(=O)(=O)c2ccccc2)CC1