Reaction Details
TargetLysine-specific histone demethylase 2
LigandBDBM50603915
Substrate/Competitorn/a
Meas. Tech.ChEMBL_2245503 (CHEMBL5159713)
IC50 9130±n/a nM
Citation Li, CSu, MZhu, WKan, WGe, TXu, GWang, SSheng, LGao, FYe, YWang, JZhou, YLi, JLiu, H Structure-Activity Relationship Study of Indolin-5-yl-cyclopropanamine Derivatives as Selective Lysine Specific Demethylase 1 (LSD1) Inhibitors. J Med Chem65:4335-4349 (2022) 
 
Lysine-specific histone demethylase 2
Name:Lysine-specific histone demethylase 2
Type:PROTEIN
Mol. Mass.:92112.91
Organism:Homo sapiens (Human)
Description:ChEMBL_992590
Residue:822
BDBM50603915
NameBDBM50603915
Synonyms:CHEMBL5191605 | US11873292, Compound A16
TypeSmall organic molecule
Emp. Form.C24H31N3O2S
Mol. Mass.425.587
SMILESO=S(=O)(N1CCc2cc(ccc12)C1CC1NCCC1CCNCC1)c1ccccc1