Reaction Details
TargetLysine-specific histone demethylase 2
LigandBDBM50603917
Substrate/Competitorn/a
Meas. Tech.ChEMBL_2245503 (CHEMBL5159713)
IC50 7510±n/a nM
Citation Li, CSu, MZhu, WKan, WGe, TXu, GWang, SSheng, LGao, FYe, YWang, JZhou, YLi, JLiu, H Structure-Activity Relationship Study of Indolin-5-yl-cyclopropanamine Derivatives as Selective Lysine Specific Demethylase 1 (LSD1) Inhibitors. J Med Chem65:4335-4349 (2022) 
 
Lysine-specific histone demethylase 2
Name:Lysine-specific histone demethylase 2
Type:PROTEIN
Mol. Mass.:92112.91
Organism:Homo sapiens (Human)
Description:ChEMBL_992590
Residue:822
BDBM50603917
NameBDBM50603917
Synonyms:CHEMBL5197243 | US11873292, Compound A17
TypeSmall organic molecule
Emp. Form.C21H25N3O2S
Mol. Mass.383.507
SMILESO=S(=O)(N1CCc2cc(ccc12)C1CC1NCC1CNC1)c1ccccc1