Reaction Details
TargetLysine-specific histone demethylase 2
LigandBDBM50603919
Substrate/Competitorn/a
Meas. Tech.ChEMBL_2245503 (CHEMBL5159713)
IC50 6470±n/a nM
Citation Li, CSu, MZhu, WKan, WGe, TXu, GWang, SSheng, LGao, FYe, YWang, JZhou, YLi, JLiu, H Structure-Activity Relationship Study of Indolin-5-yl-cyclopropanamine Derivatives as Selective Lysine Specific Demethylase 1 (LSD1) Inhibitors. J Med Chem65:4335-4349 (2022) 
 
Lysine-specific histone demethylase 2
Name:Lysine-specific histone demethylase 2
Type:PROTEIN
Mol. Mass.:92112.91
Organism:Homo sapiens (Human)
Description:ChEMBL_992590
Residue:822
BDBM50603919
NameBDBM50603919
Synonyms:CHEMBL5175125 | US11873292, Compound A24
TypeSmall organic molecule
Emp. Form.C30H35N3O2S
Mol. Mass.501.683
SMILESO=S(=O)(N1CCc2cc(ccc12)C1CC1NCC1CCN(Cc2ccccc2)CC1)c1ccccc1