Reaction Details
TargetLysine-specific histone demethylase 2
LigandBDBM50603926
Substrate/Competitorn/a
Meas. Tech.ChEMBL_2245503 (CHEMBL5159713)
IC50 19510±n/a nM
Citation Li, CSu, MZhu, WKan, WGe, TXu, GWang, SSheng, LGao, FYe, YWang, JZhou, YLi, JLiu, H Structure-Activity Relationship Study of Indolin-5-yl-cyclopropanamine Derivatives as Selective Lysine Specific Demethylase 1 (LSD1) Inhibitors. J Med Chem65:4335-4349 (2022) 
 
Lysine-specific histone demethylase 2
Name:Lysine-specific histone demethylase 2
Type:PROTEIN
Mol. Mass.:92112.91
Organism:Homo sapiens (Human)
Description:ChEMBL_992590
Residue:822
BDBM50603926
NameBDBM50603926
Synonyms:CHEMBL5174599 | US11873292, Compound A40
TypeSmall organic molecule
Emp. Form.C18H27N3O2S
Mol. Mass.349.491
SMILESCS(=O)(=O)N1CCc2cc(ccc12)C1CC1NCC1CCNCC1