Reaction Details
TargetVascular endothelial growth factor receptor 2
LigandBDBM50185175
Substrate/Competitorn/a
Meas. Tech.ChEMBL_374541 (CHEMBL862848)
IC50 160±n/a nM
Citation McBride, CMRenhowe, PAHeise, CJansen, JMLapointe, GMa, SPiñeda, RVora, JWiesmann, MShafer, CM Design and structure-activity relationship of 3-benzimidazol-2-yl-1H-indazoles as inhibitors of receptor tyrosine kinases. Bioorg Med Chem Lett16:3595-9 (2006) 
 
Vascular endothelial growth factor receptor 2
Name:Vascular endothelial growth factor receptor 2
Type:PROTEIN
Mol. Mass.:152506.58
Organism:Mus musculus
Description:ChEMBL_1469997
Residue:1367
BDBM50185175
NameBDBM50185175
Synonyms:2-(1H-indazol-3-yl)-5-morpholino-1H-benzo[d]imidazole | CHEMBL209783
TypeSmall organic molecule
Emp. Form.C18H17N5O
Mol. Mass.319.3605
SMILESC1CN(CCO1)c1ccc2nc([nH]c2c1)-c1n[nH]c2ccccc12