Reaction Details
TargetPlatelet-derived growth factor receptor beta
LigandBDBM50185173
Substrate/Competitorn/a
Meas. Tech.ChEMBL_374543 (CHEMBL862850)
IC50 440±n/a nM
Citation McBride, CMRenhowe, PAHeise, CJansen, JMLapointe, GMa, SPiñeda, RVora, JWiesmann, MShafer, CM Design and structure-activity relationship of 3-benzimidazol-2-yl-1H-indazoles as inhibitors of receptor tyrosine kinases. Bioorg Med Chem Lett16:3595-9 (2006) 
 
Platelet-derived growth factor receptor beta
Name:Platelet-derived growth factor receptor beta
Type:Enzyme
Mol. Mass.:122771.00
Organism:Mus musculus (mouse)
Description:P05622
Residue:1098
BDBM50185173
NameBDBM50185173
Synonyms:1-tert-butyl-3-(3-(5-(4-(piperidin-1-yl)piperidin-1-yl)-1H-benzo[d]imidazol-2-yl)-1H-indazol-4-yl)urea | CHEMBL379740
TypeSmall organic molecule
Emp. Form.C29H38N8O
Mol. Mass.514.665
SMILESCC(C)(C)NC(=O)Nc1cccc2[nH]nc(-c3nc4ccc(cc4[nH]3)N3CCC(CC3)N3CCCCC3)c12