Reaction Details
TargetVascular endothelial growth factor receptor 1
LigandBDBM50185184
Substrate/Competitorn/a
Meas. Tech.ChEMBL_374542 (CHEMBL862849)
IC50 11±n/a nM
Citation McBride, CMRenhowe, PAHeise, CJansen, JMLapointe, GMa, SPiñeda, RVora, JWiesmann, MShafer, CM Design and structure-activity relationship of 3-benzimidazol-2-yl-1H-indazoles as inhibitors of receptor tyrosine kinases. Bioorg Med Chem Lett16:3595-9 (2006) 
 
Vascular endothelial growth factor receptor 1
Name:Vascular endothelial growth factor receptor 1
Type:Receptor Tyrosine Kinase
Mol. Mass.:150800.23
Organism:Homo sapiens (Human)
Description:P17948
Residue:1338
BDBM50185184
NameBDBM50185184
Synonyms:2-(6-(benzyloxy)-1H-indazol-3-yl)-5-(4-(piperidin-1-yl)piperidin-1-yl)-1H-benzo[d]imidazole | CHEMBL209704
TypeSmall organic molecule
Emp. Form.C31H34N6O
Mol. Mass.506.6413
SMILESC(Oc1ccc2c(n[nH]c2c1)-c1nc2ccc(cc2[nH]1)N1CCC(CC1)N1CCCCC1)c1ccccc1