Reaction Details
TargetFibroblast growth factor receptor 1
LigandBDBM50185169
Substrate/Competitorn/a
Meas. Tech.ChEMBL_374544 (CHEMBL862851)
IC50 15±n/a nM
Citation McBride, CMRenhowe, PAHeise, CJansen, JMLapointe, GMa, SPiñeda, RVora, JWiesmann, MShafer, CM Design and structure-activity relationship of 3-benzimidazol-2-yl-1H-indazoles as inhibitors of receptor tyrosine kinases. Bioorg Med Chem Lett16:3595-9 (2006) 
 
Fibroblast growth factor receptor 1
Name:Fibroblast growth factor receptor 1
Type:Receptor
Mol. Mass.:91861.70
Organism:Homo sapiens (Human)
Description:P11362
Residue:822
BDBM50185169
NameBDBM50185169
Synonyms:2-(5-phenoxy-1H-indazol-3-yl)-5-(4-(piperidin-1-yl)piperidin-1-yl)-1H-benzo[d]imidazole | CHEMBL211662
TypeSmall organic molecule
Emp. Form.C30H32N6O
Mol. Mass.492.6147
SMILESC1CCN(CC1)C1CCN(CC1)c1ccc2nc([nH]c2c1)-c1n[nH]c2ccc(Oc3ccccc3)cc12