Reaction Details
TargetPlatelet-derived growth factor receptor beta
LigandBDBM50185171
Substrate/Competitorn/a
Meas. Tech.ChEMBL_374543 (CHEMBL862850)
IC50 1700±n/a nM
Citation McBride, CMRenhowe, PAHeise, CJansen, JMLapointe, GMa, SPiñeda, RVora, JWiesmann, MShafer, CM Design and structure-activity relationship of 3-benzimidazol-2-yl-1H-indazoles as inhibitors of receptor tyrosine kinases. Bioorg Med Chem Lett16:3595-9 (2006) 
 
Platelet-derived growth factor receptor beta
Name:Platelet-derived growth factor receptor beta
Type:Enzyme
Mol. Mass.:122771.00
Organism:Mus musculus (mouse)
Description:P05622
Residue:1098
BDBM50185171
NameBDBM50185171
Synonyms:CHEMBL379108 | N-(cyclohexylmethyl)-3-(5-(4-(piperidin-1-yl)piperidin-1-yl)-1H-benzo[d]imidazol-2-yl)-1H-indazol-5-amine
TypeSmall organic molecule
Emp. Form.C31H41N7
Mol. Mass.511.7041
SMILESC(Nc1ccc2[nH]nc(-c3nc4ccc(cc4[nH]3)N3CCC(CC3)N3CCCCC3)c2c1)C1CCCCC1