Reaction Details
TargetVascular endothelial growth factor receptor 1
LigandBDBM50185187
Substrate/Competitorn/a
Meas. Tech.ChEMBL_374542 (CHEMBL862849)
IC50>3000±n/a nM
Citation McBride, CMRenhowe, PAHeise, CJansen, JMLapointe, GMa, SPiñeda, RVora, JWiesmann, MShafer, CM Design and structure-activity relationship of 3-benzimidazol-2-yl-1H-indazoles as inhibitors of receptor tyrosine kinases. Bioorg Med Chem Lett16:3595-9 (2006) 
 
Vascular endothelial growth factor receptor 1
Name:Vascular endothelial growth factor receptor 1
Type:Receptor Tyrosine Kinase
Mol. Mass.:150800.23
Organism:Homo sapiens (Human)
Description:P17948
Residue:1338
BDBM50185187
NameBDBM50185187
Synonyms:1-tert-butyl-3-(3-(5-(4-(piperidin-1-yl)piperidin-1-yl)-1H-benzo[d]imidazol-2-yl)-1H-indazol-7-yl)urea | CHEMBL212262
TypeSmall organic molecule
Emp. Form.C29H38N8O
Mol. Mass.514.665
SMILESCC(C)(C)NC(=O)Nc1cccc2c(n[nH]c12)-c1nc2ccc(cc2[nH]1)N1CCC(CC1)N1CCCCC1