Reaction Details
TargetFibroblast growth factor receptor 1
LigandBDBM50185185
Substrate/Competitorn/a
Meas. Tech.ChEMBL_374544 (CHEMBL862851)
IC50 270±n/a nM
Citation McBride, CMRenhowe, PAHeise, CJansen, JMLapointe, GMa, SPiñeda, RVora, JWiesmann, MShafer, CM Design and structure-activity relationship of 3-benzimidazol-2-yl-1H-indazoles as inhibitors of receptor tyrosine kinases. Bioorg Med Chem Lett16:3595-9 (2006) 
 
Fibroblast growth factor receptor 1
Name:Fibroblast growth factor receptor 1
Type:Receptor
Mol. Mass.:91861.70
Organism:Homo sapiens (Human)
Description:P11362
Residue:822
BDBM50185185
NameBDBM50185185
Synonyms:2-(1H-indazol-3-yl)-5-((4-methylpiperazin-1-yl)methyl)-1H-benzo[d]imidazole | CHEMBL209265
TypeSmall organic molecule
Emp. Form.C20H22N6
Mol. Mass.346.4289
SMILESCN1CCN(Cc2ccc3nc([nH]c3c2)-c2n[nH]c3ccccc23)CC1