Reaction Details
TargetBeta-glucosidase
LigandBDBM50185229
Substrate/Competitorn/a
Meas. Tech.ChEMBL_359898 (CHEMBL854292)
Ki 61000±n/a nM
Citation Pearson, MSSaad, RODintinger, TAmri, HMathé-Allainmat, MLebreton, J Flexible synthesis and biological evaluation of novel 5-deoxyadenophorine analogues. Bioorg Med Chem Lett16:3262-7 (2006) 
 
Beta-glucosidase
Name:Beta-glucosidase
Synonyms:n/a
Type:PROTEIN
Mol. Mass.:60428.49
Organism:Prunus avium
Description:ChEMBL_37428
Residue:531
BDBM50185229
NameBDBM50185229
TypeSmall organic molecule
Emp. Form.C13H27NO3
Mol. Mass.245.3584
SMILESCCCCCCC[C@@H]1C[C@@H](O)[C@@H](O)[C@@H](CO)N1